The Community Forums

Interact with an entire community of cPanel & WHM users!
  1. This site uses cookies. By continuing to use this site, you are agreeing to our use of cookies. Learn More.

apache compile error

Discussion in 'EasyApache' started by odi, May 9, 2005.

  1. odi

    odi Registered

    Joined:
    Sep 5, 2004
    Messages:
    1
    Likes Received:
    0
    Trophy Points:
    1
    ...
    make -j 4 php-4.3.11....... . . . . . . . . . . . . . . . . . . . . . . . . . . . . . . . . . . . . . . . . . . . . . . . . . Done
    /home/cpapachebuild/buildapache/php-4.3.11/ext/swf/swf.c:256: error: label at end of compound statement
    make: *** [ext/swf/swf.lo] Error 1
    make: *** Waiting for unfinished jobs....


    make php-4.3.11...(install).... Done
    /home/cpapachebuild/buildapache/php-4.3.11/ext/swf/swf.c:256: error: label at end of compound statement
    make: *** [ext/swf/swf.lo] Error 1

    /etc/rc.d/init.d/httpd start: httpd started

    configure php-4.3.11...(--prefix=/usr --with-xml --enable-bcmath --enable-calendar --with-curl --with-dom --with-dom-xslt --with-dom-exslt --enable-exif --with-swf=/usr/local/flash --enable-ftp --with-gd --with-jpeg-dir=/usr/local --with-png-dir=/usr --with-xpm-dir=/usr/X11R6 --with-gettext --with-imap --with-imap-ssl --with-kerberos --enable-mbstring --enable-mbstr-enc-trans --enable-mbregex --with-mcrypt --with-mhash --with-ming=../ming-0.2a --enable-magic-quotes --with-mysql=/usr --with-openssl --enable-discard-path --with-pdflib --with-pear --with-pgsql=/usr --with-pspell --enable-safe-mode --enable-sockets --enable-track-vars --with-ttf --with-freetype-dir=/usr --enable-gd-native-ttf --enable-versioning --enable-wddx --with-xmlrpc --with-zip --with-zlib).... . . . . . . . . . . . . Done

    make -j 4 php-4.3.11...(clean).... Done

    make -j 4 php-4.3.11....... . . . . . . . . . . . . . . . . . . . . . . . . . . . . . . . . . . . Done
    /home/cpapachebuild/buildapache/php-4.3.11/ext/swf/swf.c:256: error: label at end of compound statement
    make: *** [ext/swf/swf.lo] Error 1
    make: *** Waiting for unfinished jobs....


    make php-4.3.11...(install).... Done
    /home/cpapachebuild/buildapache/php-4.3.11/ext/swf/swf.c:256: error: label at end of compound statement
    make: *** [ext/swf/swf.lo] Error 1

    initfpsuexec: using apache 1.x support
    PHP version file is up to date
    Executing /scripts/postbuildapache (if exists)...Done
    /etc/rc.d/init.d/httpd start: httpd started
    ...
     
  2. AndyReed

    AndyReed Well-Known Member
    PartnerNOC

    Joined:
    May 29, 2004
    Messages:
    2,222
    Likes Received:
    3
    Trophy Points:
    38
    Location:
    Minneapolis, MN
    You need to recompile Apache without exif and flash modules. It seems that there are missing libraries needed to complete Apache build without errors.

    Hope this helps!
     
  3. DIYHosting

    DIYHosting Well-Known Member

    Joined:
    Nov 27, 2003
    Messages:
    60
    Likes Received:
    0
    Trophy Points:
    6
    Location:
    Saskatoon, SK, Canada
    I got this too while compiling on my new server I just ordered. Hrmm, this needs to be fixed!
     
Loading...

Share This Page