The Community Forums

Interact with an entire community of cPanel & WHM users.
  1. This site uses cookies. By continuing to use this site, you are agreeing to our use of cookies. Learn More.

CURL Installation Problems

Discussion in 'General Discussion' started by aisagtr, Jun 23, 2007.

  1. aisagtr

    aisagtr Guest

    While installing curl, we got this:

    make[1]: *** [install] Error 2
    make: *** [install-recursive] Error 1
    Fetching http://httpupdate.cpanel.net/buildapache/1/php-5.2.0.tar.gz (0)....@198.66.92.150......connected......receiving...1%...2%...3%...4%...5%...6%...7%...8%...9%...10%...11%...12%...13%...14%...15%...16%...17%...18%...19%...20%...21%...22%...23%...24%...25%...26%...27%...28%...29%...30%...31%...32%...33%...34%...35%...36%...37%...38%...39%...40%...41%...42%...43%...44%...45%...46%...47%...48%...49%...50%...51%...52%...53%...54%...55%...56%...57%...58%...59%...60%...61%...62%...63%...64%...65%...66%...67%...68%...69%...70%...71%...72%...73%...74%...75%...76%...77%...78%...79%...80%...81%...82%...83%...84%...85%...86%...87%...88%...89%...90%...91%...92%...93%...94%...95%...96%...97%...98%...99%...100%......Done
    Untarring php....Done
    Running configure:
    LDFLAGS="-L/usr/X11R6/lib64" /home/cpapachebuild/buildapache/callbacklog --prog configure --dir /home/cpapachebuild/buildapache/build-log -- --enable-pic --with-apxs=/usr/local/apache/bin/apxs --with-libdir=lib64 --prefix=/usr/local --with-xml --enable-bcmath --enable-calendar --with-curl --enable-ftp --with-gd --with-jpeg-dir=/usr/local --with-png-dir=/usr --with-xpm-dir=/usr/X11R6 --enable-memory-limit --enable-magic-quotes --with-mysqli --with-mysql=/usr --enable-discard-path --with-pear --enable-sockets --enable-track-vars --with-zlib

    ./configure [@php-5.2.0]...(--enable-pic --with-apxs=/usr/local/apache/bin/apxs --with-libdir=lib64 --prefix=/usr/local --with-xml --enable-bcmath --enable-calendar --with-curl --enable-ftp --with-gd --with-jpeg-dir=/usr/local --with-png-dir=/usr --with-xpm-dir=/usr/X11R6 --enable-memory-limit --enable-magic-quotes --with-mysqli --with-mysql=/usr --enable-discard-path --with-pear --enable-sockets --enable-track-vars --with-zlib).... . . . . . . . . . . . . . . . . . . . . . . . . . . . . . . . . . . Done

    make [@php-5.2.0]...(-j 2 clean).... Done

    make [@php-5.2.0]...(-j 2).... . . . . . . . . . . . . . . . Done
    gcc: Internal error: Terminated (program cc1)
    Please submit a full bug report.
    See <URL:http://bugzilla.redhat.com/bugzilla> for instructions.
    make: *** [ext/date/lib/parse_date.lo] Error 1
    make: *** Waiting for unfinished jobs....


    Anyone any idea?
     
Loading...

Share This Page