The Community Forums

Interact with an entire community of cPanel & WHM users.
  1. This site uses cookies. By continuing to use this site, you are agreeing to our use of cookies. Learn More.

Easyapache error

Discussion in 'EasyApache' started by jdpravin, Jan 30, 2009.

  1. jdpravin

    jdpravin Registered

    Joined:
    Aug 23, 2004
    Messages:
    4
    Likes Received:
    0
    Trophy Points:
    1
    Any fix to libxml error of Easy apache?

    Tried this as well but didn't helped :-(

    Upgraded Cpanel to the latest as well ?
     
  2. jdpravin

    jdpravin Registered

    Joined:
    Aug 23, 2004
    Messages:
    4
    Likes Received:
    0
    Trophy Points:
    1
    error is

    In file included from /home/cpeasyapache/src/php-5.2.8/main/php.h:100,
    from /home/cpeasyapache/src/php-5.2.8/ext/libxml/libxml.c:28:
    /home/cpeasyapache/src/php-5.2.8/main/build-defs.h:22: error: expected identifier or '(' before '\x20'
    /home/cpeasyapache/src/php-5.2.8/main/build-defs.h:23: error: missing terminating ' character
    make: *** [ext/libxml/libxml.lo] Error 1
    !! 'make' failed with exit code '512' !!
    !! Restoring original working apache !!
     
  3. cPanelNick

    cPanelNick Administrator
    Staff Member

    Joined:
    Mar 9, 2015
    Messages:
    3,426
    Likes Received:
    2
    Trophy Points:
    38
    cPanel Access Level:
    DataCenter Provider
    Please open a ticket @ https://tickets.cpanel.net/submit/

    As Dan is looking into this problem please put ATTN: Dan in the subject
     
Loading...

Share This Page