The Community Forums

Interact with an entire community of cPanel & WHM users!
  1. This site uses cookies. By continuing to use this site, you are agreeing to our use of cookies. Learn More.

EasyApache problems

Discussion in 'EasyApache' started by acer2k, Jun 14, 2003.

  1. acer2k

    acer2k Well-Known Member

    Nov 12, 2001
    Likes Received:
    Trophy Points:
    EasyApache problems. When I run it I get this :

    /bin/sh ./mkinstalldirs /usr/bin
    /usr/bin/install -c curl-config /usr/bin/curl-config
    make[2]: Nothing to be done for `install-data-am'.
    make[2]: Leaving directory `/home/cpapachebuild/buildapache/curl-7.10.5'
    make[1]: Leaving directory `/home/cpapachebuild/buildapache/curl-7.10.5'
    Untarring php....Done
    can't find file to patch at input line 3
    Perhaps you used the wrong -p or --strip option?
    The text leading up to this was:
    |--- ext/gd.old/gd.c Tue Sep 3 09:09:29 2002
    |+++ ext/gd/gd.c Wed Oct 23 14:12:22 2002
    File to patch:

    Then it just stops.. So I press enter a few times and when it gets done I start getting this error:

    make[3]: Entering directory `/home/cpapachebuild/buildapache/php-4.2.3/ext/gd'
    gcc -I. -I/home/cpapachebuild/buildapache/php-4.2.3/ext/gd -I/home/cpapachebuild/buildapache/php-4.2.3/main -I/home/cpapachebuild/buildapache/php-4.2.3 -I/home/cpapachebuild/buildapache/php-4.2.3/Zend -I/usr/include/freetype2/freetype -I/home/cpapachebuild/buildapache/gd-2.0.15 -I/home/cpapachebuild/buildapache/php-4.2.3/ext/mysql/libmysql -I/home/cpapachebuild/buildapache/php-4.2.3/ext/xml/expat -I/home/cpapachebuild/buildapache/php-4.2.3/TSRM -g -O2 -c gd.c && touch gd.lo
    In file included from gd.c:83:
    gd_ctx.c: In function `_php_image_output_ctx':
    gd_ctx.c:70: structure has no member named `free'
    gd_ctx.c:98: structure has no member named `free'
    gd.c: In function `_php_image_type':
    gd.c:1014: structure has no member named `free'
    gd.c:1017: structure has no member named `free'
    gd.c: In function `_php_image_create_from':
    gd.c:1209: structure has no member named `free'
    make[3]: *** [gd.lo] Error 1
    make[3]: Leaving directory `/home/cpapachebuild/buildapache/php-4.2.3/ext/gd'
    make[2]: *** [install-recursive] Error 1
    make[2]: Leaving directory `/home/cpapachebuild/buildapache/php-4.2.3/ext/gd'
    make[1]: *** [install-recursive] Error 1
    make[1]: Leaving directory `/home/cpapachebuild/buildapache/php-4.2.3/ext'
    make: *** [install-recursive] Error 1
    Scanning suexec_log.Done
    Waiting for httpd to restart..............finished.

    6079 6078 6077 6076 6075 6068

    httpd started ok
    root@nameless3 [~]# Support Ticket Number:

Share This Page