The Community Forums

Interact with an entire community of cPanel & WHM users!
  1. This site uses cookies. By continuing to use this site, you are agreeing to our use of cookies. Learn More.

[Error] with EasyApache

Discussion in 'EasyApache' started by Clinton44, Jan 24, 2010.

  1. Clinton44

    Clinton44 Member

    Joined:
    Mar 19, 2008
    Messages:
    7
    Likes Received:
    0
    Trophy Points:
    1
    I keep getting a ton of errors with easyapache, new ones everytime it seems.

    Code:
    If the browser window is closed or stopped the build will continue in the background.
    The build output should start shortly...
    
    Distilled successfully
    !! Verbose logfile is at '/usr/local/cpanel/logs/easy/apache/build.1264425510' !!
    !!
    Ouput from '/bin/sh -c "ulimit -a"':
    core file size          (blocks, -c) 0
    data seg size           (kbytes, -d) unlimited
    scheduling priority             (-e) 0
    file size               (blocks, -f) unlimited
    pending signals                 (-i) 73216
    max locked memory       (kbytes, -l) 32
    max memory size         (kbytes, -m) 524288
    open files                      (-n) 1024
    pipe size            (512 bytes, -p) 8
    POSIX message queues     (bytes, -q) 819200
    real-time priority              (-r) 0
    stack size              (kbytes, -s) 10240
    cpu time               (seconds, -t) unlimited
    max user processes              (-u) 73216
    virtual memory          (kbytes, -v) 524288
    file locks                      (-x) unlimited
    !!
    
        -- Begin step 'Create task list to do after apache is built' --
        -- End step 'Create task list to do after apache is built' --
    -- End opt 'Mod SuPHP' --
    
    -- Begin opt 'Proxy' --
    
    Hunk #4 succeeded at 1990 (offset 9 lines).
        -- End dryrun test 'Applying patch for Apache bug #47673' --
        -- Begin dryrun test 'Applying patch for CVE-2009-3555' --
    /home/cpeasyapache/src/httpd-2.2.14/srclib/apr/libtool --silent --mode=compile gcc --param ggc-min-expand=1 --param ggc-min-heapsize=4096 -m64 -fPIC -DPIC -pthread  --param ggc-min-expand=1 --param ggc-min-heapsize=4096 -m64 -fPIC -DPIC  -DLINUX=2 -D_REENTRANT -D_GNU_SOURCE    -I/home/cpeasyapache/src/httpd-2.2.14/srclib/pcre -I. -I/home/cpeasyapache/src/httpd-2.2.14/os/unix -I/home/cpeasyapache/src/httpd-2.2.14/server/mpm/prefork -I/home/cpeasyapache/src/httpd-2.2.14/modules/http -I/home/cpeasyapache/src/httpd-2.2.14/modules/filters -I/home/cpeasyapache/src/httpd-2.2.14/modules/proxy -I/home/cpeasyapache/src/httpd-2.2.14/include -I/home/cpeasyapache/src/httpd-2.2.14/modules/generators -I/home/cpeasyapache/src/httpd-2.2.14/modules/mappers -I/home/cpeasyapache/src/httpd-2.2.14/modules/database -I/home/cpeasyapache/src/httpd-2.2.14/srclib/apr/include -I/home/cpeasyapache/src/httpd-2.2.14/srclib/apr-util/include -I/home/cpeasyapache/src/httpd-2.2.14/modules/proxy/../generators -I/usr/include -I/usr/kerberos/include -I/home/cpeasyapache/src/httpd-2.2.14/modules/ssl -I/home/cpeasyapache/src/httpd-2.2.14/modules/dav/main  -prefer-non-pic -static -c ssl_engine_config.c && touch ssl_engine_config.lo
    /home/cpeasyapache/src/httpd-2.2.14/srclib/apr/libtool --silent --mode=compile gcc --param ggc-min-expand=1 --param ggc-min-heapsize=4096 -m64 -fPIC -DPIC -pthread  --param ggc-min-expand=1 --param ggc-min-heapsize=4096 -m64 -fPIC -DPIC  -DLINUX=2 -D_REENTRANT -D_GNU_SOURCE    -I/home/cpeasyapache/src/httpd-2.2.14/srclib/pcre -I. -I/home/cpeasyapache/src/httpd-2.2.14/os/unix -I/home/cpeasyapache/src/httpd-2.2.14/server/mpm/prefork -I/home/cpeasyapache/src/httpd-2.2.14/modules/http -I/home/cpeasyapache/src/httpd-2.2.14/modules/filters -I/home/cpeasyapache/src/httpd-2.2.14/modules/proxy -I/home/cpeasyapache/src/httpd-2.2.14/include -I/home/cpeasyapache/src/httpd-2.2.14/modules/generators -I/home/cpeasyapache/src/httpd-2.2.14/modules/mappers -I/home/cpeasyapache/src/httpd-2.2.14/modules/database -I/home/cpeasyapache/src/httpd-2.2.14/srclib/apr/include -I/home/cpeasyapache/src/httpd-2.2.14/srclib/apr-util/include -I/home/cpeasyapache/src/httpd-2.2.14/modules/proxy/../generators -I/usr/include -I/usr/kerberos/include -I/home/cpeasyapache/src/httpd-2.2.14/modules/ssl -I/home/cpeasyapache/src/httpd-2.2.14/modules/dav/main  -prefer-non-pic -static -c ssl_engine_dh.c && touch ssl_engine_dh.lo
    /home/cpeasyapache/src/httpd-2.2.14/srclib/apr/libtool --silent --mode=compile gcc --param ggc-min-expand=1 --param ggc-min-heapsize=4096 -m64 -fPIC -DPIC -pthread  --param ggc-min-expand=1 --param ggc-min-heapsize=4096 -m64 -fPIC -DPIC  -DLINUX=2 -D_REENTRANT -D_GNU_SOURCE    -I/home/cpeasyapache/src/httpd-2.2.14/srclib/pcre -I. -I/home/cpeasyapache/src/httpd-2.2.14/os/unix -I/home/cpeasyapache/src/httpd-2.2.14/server/mpm/prefork -I/home/cpeasyapache/src/httpd-2.2.14/modules/http -I/home/cpeasyapache/src/httpd-2.2.14/modules/filters -I/home/cpeasyapache/src/httpd-2.2.14/modules/proxy -I/home/cpeasyapache/src/httpd-2.2.14/include -I/home/cpeasyapache/src/httpd-2.2.14/modules/generators -I/home/cpeasyapache/src/httpd-2.2.14/modules/mappers -I/home/cpeasyapache/src/httpd-2.2.14/modules/database -I/home/cpeasyapache/src/httpd-2.2.14/srclib/apr/include -I/home/cpeasyapache/src/httpd-2.2.14/srclib/apr-util/include -I/home/cpeasyapache/src/httpd-2.2.14/modules/proxy/../generators -I/usr/include -I/usr/kerberos/include -I/home/cpeasyapache/src/httpd-2.2.14/modules/ssl -I/home/cpeasyapache/src/httpd-2.2.14/modules/dav/main  -prefer-non-pic -static -c ssl_engine_init.c && touch ssl_engine_init.lo
    /home/cpeasyapache/src/httpd-2.2.14/srclib/apr/libtool: line 1103: /bin/sed: Argument list too long
    gcc: : No such file or directory
    make[3]: *** [ssl_engine_init.lo] Error 1
    make[3]: Leaving directory `/home/cpeasyapache/src/httpd-2.2.14/modules/ssl'
    make[2]: *** [all-recursive] Error 1
    make[2]: Leaving directory `/home/cpeasyapache/src/httpd-2.2.14/modules/ssl'
    make[1]: *** [all-recursive] Error 1
    make[1]: Leaving directory `/home/cpeasyapache/src/httpd-2.2.14/modules'
    make: *** [all-recursive] Error 1
    !! 'make' failed with exit code '512' !!
    !! Restoring original working apache !!
    
    !! Executing '/scripts/initsslhttpd' !!
    !! Restarting 'httpd' ... !!
    !! 'httpd' restart complete. !!
    Building global cache for cpanel...Done
    !! Executing '/scripts/initfpsuexec' !!
    !! Executing '/scripts/initsslhttpd' !!
    !! Verbose logfile is at '/usr/local/cpanel/logs/easy/apache/build.1264425510' !!
    Running on OpenVZ, Centos, 6GB of memory.

    The build before this said it couldn't allocate enough memory farther down in the build process.

    Code was shortened to show errors.
     
  2. ModServ

    ModServ Well-Known Member

    Joined:
    Oct 17, 2006
    Messages:
    332
    Likes Received:
    5
    Trophy Points:
    18
    Location:
    Egypt
    cPanel Access Level:
    Root Administrator
    Execute these commands first then run easyapache again and try

     
  3. cPanelDon

    cPanelDon cPanel Quality Assurance Analyst
    Staff Member

    Joined:
    Nov 5, 2008
    Messages:
    2,557
    Likes Received:
    7
    Trophy Points:
    38
    Location:
    Houston, Texas, U.S.A.
    cPanel Access Level:
    DataCenter Provider
    Twitter:
    Clinton44, after a failed build (and before restarting the VPS), what is the output of the following command (via root SSH access)?
    Code:
    # cat /proc/user_beancounters
    For formatting the resulting information in the post, using a CODE block to quote the output will help greatly.
     
  4. Clinton44

    Clinton44 Member

    Joined:
    Mar 19, 2008
    Messages:
    7
    Likes Received:
    0
    Trophy Points:
    1
    I resolved this yesterday,

    It was the result of kmemsize being too low. Thanks for the help.
     
Loading...

Share This Page