The Community Forums

Interact with an entire community of cPanel & WHM users!
  1. This site uses cookies. By continuing to use this site, you are agreeing to our use of cookies. Learn More.

Errors with compilers and segmentation fault when using easyapache

Discussion in 'EasyApache' started by deicox, Jan 23, 2005.

  1. deicox

    deicox Member

    Joined:
    Mar 15, 2004
    Messages:
    12
    Likes Received:
    0
    Trophy Points:
    1
    Hello.

    Yesterday and today I recive error messages in my system when I want to compile apache. this is the messages:

    Untarring modssl....
    patching file pkg.sslmod/libssl.module
    configure mod_ssl-2.8.22-1.3.33...(--with-apache=../apache_1.3.33 --with-ssl=/usr --enable-module=expires --enable-shared=expires --enable-module=rewrite --enable-shared=rewrite)..............Done
    configure apache_1.3.33...(--enable-module=ssl --enable-module=expires --enable-shared=expires --enable-module=rewrite --enable-shared=rewrite).........Done
    make apache_1.3.33......................Done
    ssl_engine_vars.c:266: internal error: Segmentation fault
    Please submit a full bug report,
    with preprocessed source if appropriate.
    See <URL:http://bugzilla.redhat.com/bugzilla/> for instructions.
    Preprocessed source stored into /tmp/cc3lghkt.out file, please attach this to your bugreport.
    make[4]: *** [ssl_engine_vars.o] Error 1
    make[3]: *** [all] Error 1
    make[2]: *** [subdirs] Error 1
    make[1]: *** [build-std] Error 2
    make: *** [build] Error 2
    make apache_1.3.33...(install)....Done
    /usr/include/sys/sysmacros.h:56: internal error: Segmentation fault
    Please submit a full bug report,
    with preprocessed source if appropriate.
    See <URL:http://bugzilla.redhat.com/bugzilla/> for instructions.
    Preprocessed source stored into /tmp/ccUfljS7.out file, please attach this to your bugreport.
    make[5]: *** [ssl_engine_vars.o] Error 1
    make[4]: *** [all] Error 1
    make[3]: *** [subdirs] Error 1
    make[2]: *** [build-std] Error 2
    make[1]: *** [build] Error 2
    make: *** [install-all] Error 2
    WARNING: MaxClients of 450 exceeds compile time limit of 256 servers,
    lowering MaxClients to 256. To increase, please see the
    HARD_SERVER_LIMIT define in src/include/httpd.h.
    [Sun Jan 23 10:08:43 2005] [warn] NameVirtualHost IP:80 has no VirtualHosts
    /etc/rc.d/init.d/httpd start: httpd started
    Setting /home permissions to 0711......Done
    Setting permissions for.....nfsnobody...cpanel...mailman...sefm...digizona...animeto...clamav...adserver...factory...forums...yague......Done
    10:08:50 URL:http://layer1.cpanel.net/buildapache/1/php-4.3.10.tar.gz [4892209/4892209] -> "php-4.3.10.tar.gz" [1]
    Untarring php....Done
    Applying CURL curl_formfree patch
    patching file ext/curl/curl.c
    Hunk #1 succeeded at 563 (offset 18 lines).
    Hunk #2 succeeded at 892 (offset 7 lines).
    configure php-4.3.10...(--with-apxs=/usr/local/apache/bin/apxs --with-xml --enable-bcmath --enable-calendar --enable-ftp --with-gd --with-jpeg-dir=/usr/local --with-png-dir=/usr --with-xpm-dir=/usr/X11R6 --enable-magic-quotes --with-mysql --enable-discard-path --with-pear --enable-safe-mode --enable-sockets --enable-track-vars --with-ttf --with-freetype-dir=/usr --enable-gd-native-ttf --enable-versioning --with-zlib).....Done
    configure: error: installation or configuration problem: C compiler cannot create executables.
    make php-4.3.10...(clean).....Done
    make php-4.3.10.......Done
    make php-4.3.10...(install)....Done
    WARNING: MaxClients of 450 exceeds compile time limit of 256 servers,
    lowering MaxClients to 256. To increase, please see the
    HARD_SERVER_LIMIT define in src/include/httpd.h.
    [Sun Jan 23 10:08:58 2005] [warn] NameVirtualHost IP:80 has no VirtualHosts
    /etc/rc.d/init.d/httpd start: httpd started
    configure php-4.3.10...(--prefix=/usr --with-xml --enable-bcmath --enable-calendar --enable-ftp --with-gd --with-jpeg-dir=/usr/local --with-png-dir=/usr --with-xpm-dir=/usr/X11R6 --enable-magic-quotes --with-mysql --enable-discard-path --with-pear --enable-safe-mode --enable-sockets --enable-track-vars --with-ttf --with-freetype-dir=/usr --enable-gd-native-ttf --enable-versioning --with-zlib).....Done
    configure: error: installation or configuration problem: C compiler cannot create executables.
    make php-4.3.10...(clean)....Done
    make php-4.3.10.......Done
    make php-4.3.10...(install)....Done
    initfpsuexec: using apache 1.x support
    PHP version file is up to date
    Executing /scripts/postbuildapache (if exists)...Done
    WARNING: MaxClients of 450 exceeds compile time limit of 256 servers,
    lowering MaxClients to 256. To increase, please see the
    HARD_SERVER_LIMIT define in src/include/httpd.h.


    What can we do to resolve this problems? thanks a lot for responses.
     
  2. chirpy

    chirpy Well-Known Member

    Joined:
    Jun 15, 2002
    Messages:
    13,475
    Likes Received:
    20
    Trophy Points:
    38
    Location:
    Go on, have a guess
    Does the file that it reports exist, wand what's in it? /tmp/cc3lghkt.out
     
Loading...

Share This Page