The Community Forums

Interact with an entire community of cPanel & WHM users!
  1. This site uses cookies. By continuing to use this site, you are agreeing to our use of cookies. Learn More.

make error on pdf

Discussion in 'General Discussion' started by NoAgendas, Aug 31, 2006.

  1. NoAgendas

    NoAgendas Guest

    make [@PDFlib-Lite-6.0.0p1]...(-j 4).... . . . . . . . . . . . . . . . . . . . . . . . . . . . . . . . . . . . . . . . . . . . . . . . . . . . . . . . . . . . . . . . . . . . . . . . . . . . . Done

    make[2]: *** [all] Error 2
    make[1]: *** [all] Error 2

    make [@PDFlib-Lite-6.0.0p1]...(install).... . Done

    make[2]: *** [install] Error 2
    make[1]: *** [install] Error 2

    Got the above during apache compile in whm.

    Anyone know the cause of the errors? I did have pdf selected obviously as one of the modules

    using php 5.1.6 / mysql 5x
     
Loading...

Share This Page