The Community Forums

Interact with an entire community of cPanel & WHM users!
  1. This site uses cookies. By continuing to use this site, you are agreeing to our use of cookies. Learn More.

Mcrypt.so Problem

Discussion in 'General Discussion' started by Andrea Guglielm, Mar 17, 2012.

  1. Andrea Guglielm

    Andrea Guglielm Registered

    Joined:
    Mar 17, 2012
    Messages:
    1
    Likes Received:
    0
    Trophy Points:
    1
    cPanel Access Level:
    Root Administrator
    Log File:
    Code:
    [18-Mar-2012 00:37:17 UTC] PHP Warning:  PHP Startup: Invalid library (maybe not a PHP library) 'mcrypt.so' in Unknown on line 0
    [18-Mar-2012 00:37:20 UTC] PHP Warning:  PHP Startup: Invalid library (maybe not a PHP library) 'mcrypt.so' in Unknown on line 0
    [18-Mar-2012 00:51:12 UTC] PHP Warning:  PHP Startup: Invalid library (maybe not a PHP library) 'mcrypt.so' in Unknown on line 0
    [18-Mar-2012 01:38:44 UTC] PHP Warning:  PHP Startup: Invalid library (maybe not a PHP library) 'mcrypt.so' in Unknown on line 0
    [18-Mar-2012 01:38:47 UTC] PHP Warning:  PHP Startup: Invalid library (maybe not a PHP library) 'mcrypt.so' in Unknown on line 0
    [18-Mar-2012 01:41:46 UTC] PHP Warning:  PHP Startup: Invalid library (maybe not a PHP library) 'mcrypt.so' in Unknown on line 0
    [18-Mar-2012 01:44:45 UTC] PHP Warning:  PHP Startup: Invalid library (maybe not a PHP library) 'mcrypt.so' in Unknown on line 0
    [18-Mar-2012 01:57:28 UTC] PHP Warning:  PHP Startup: Invalid library (maybe not a PHP library) 'mcrypt.so' in Unknown on line 0
    root@evangelion [/home/cpeasyapache/src/php-5.3.10/ext/mcrypt]# cat /usr/local/cpanel/version
    Code:
    11.32.2.7
    root@evangelion [/usr/local/lib/php/extensions/no-debug-non-zts-20090626]# ll
    Code:
    total 5.3M
    -rw-r--r-- 1 root root  78K Mar 18 02:57 ixed.5.3.lin
    -rwxr-xr-x 1 root root 142K Mar 18 02:44 mcrypt.so
    -rwxr-xr-x 1 root root 178K Mar 18 02:53 pdo_mysql.so
    -rwxr-xr-x 1 root root 322K Mar 18 02:53 pdo.so
    -rwxr-xr-x 1 root root 2.5M Mar 18 02:53 pdo_sqlite.so
    -rwxr-xr-x 1 root root 1.2M Mar 18 02:53 sqlite.so
    -rwxr-xr-x 1 root root 597K Mar 18 02:57 suhosin.so
    -rw-r--r-- 1 root root 312K Mar 18 02:56 timezonedb.so
    -rw-r--r-- 1 root root  53K Mar 18 02:57 uploadprogress.so
    root@evangelion [/usr/local/lib/php/extensions/no-debug-non-zts-20090626]# grep extension /usr/local/lib/php.ini
    Code:
    ; dynamically loaded extension (either a PHP extension or a Zend extension),
    ; you may only use these constants *after* the line that loads the extension.
    ; leading '/'. You must also specify the file extension being used including
    ; Directory in which the loadable extensions (modules) reside.
    extension_dir = "/usr/local/lib/php/extensions/no-debug-non-zts-20090626"
    zend_extension="/usr/local/IonCube/ioncube_loader_lin_5.3.so"
    extension="suhosin.so"
    extension=uploadprogress.so
    extension=timezonedb.so
    extension = "pdo.so"
    extension = "pdo_sqlite.so"
    extension = "sqlite.so"
    extension = "pdo_mysql.so"
    extension = "mcrypt.so"
    ; If you wish to have an extension loaded automatically, use the following
    ; needs to go here.  Specify the location of the extension with the
    ; extension_dir directive above.
    ; dictionary files.  Include the base filename, but not the file extension.
    extension="ixed.5.3.lin"
    zend_extension="/usr/local/Zend/lib/Guard-5.5.0/php-5.3.x/ZendGuardLoader.so"
    root@evangelion [/home/cpeasyapache/src/php-5.3.10/ext/mcrypt]# phpize
    Code:
    Configuring for:
    PHP Api Version:         20090626
    Zend Module Api No:      20090626
    Zend Extension Api No:   220090626
    root@evangelion [/home/cpeasyapache/src/php-5.3.10/ext/mcrypt]# ./configure
    Code:
    checking for grep that handles long lines and -e... /bin/grep
    checking for egrep... /bin/grep -E
    checking for a sed that does not truncate output... /bin/sed
    checking for cc... cc
    checking for C compiler default output file name... a.out
    checking whether the C compiler works... yes
    checking whether we are cross compiling... no
    checking for suffix of executables...
    checking for suffix of object files... o
    checking whether we are using the GNU C compiler... yes
    checking whether cc accepts -g... yes
    checking for cc option to accept ISO C89... none needed
    checking how to run the C preprocessor... cc -E
    checking for icc... no
    checking for suncc... no
    checking whether cc understands -c and -o together... yes
    checking for system library directory... lib
    checking if compiler supports -R... no
    checking if compiler supports -Wl,-rpath,... yes
    checking build system type... x86_64-unknown-linux-gnu
    checking host system type... x86_64-unknown-linux-gnu
    checking target system type... x86_64-unknown-linux-gnu
    checking for PHP prefix... /usr/local
    checking for PHP includes... -I/usr/local/include/php -I/usr/local/include/php/main -I/usr/local/include/php/TSRM -I/usr/local/include/php/Zend -I/usr/local/include/php/ext -I/usr/local/include/php/ext/date/lib
    checking for PHP extension directory... /usr/local/lib/php/extensions/no-debug-non-zts-20090626
    checking for PHP installed headers prefix... /usr/local/include/php
    checking if debug is enabled... no
    checking if zts is enabled... no
    checking for re2c... re2c
    checking for re2c version... invalid
    configure: WARNING: You will need re2c 0.13.4 or later if you want to regenerate PHP parsers.
    checking for gawk... gawk
    checking for mcrypt support... yes, shared
    checking for libmcrypt version... >= 2.5.6
    checking for mcrypt_module_open in -lmcrypt... yes
    checking for ld used by cc... /usr/bin/ld
    checking if the linker (/usr/bin/ld) is GNU ld... yes
    checking for /usr/bin/ld option to reload object files... -r
    checking for BSD-compatible nm... /usr/bin/nm -B
    checking whether ln -s works... yes
    checking how to recognize dependent libraries... pass_all
    checking for ANSI C header files... yes
    checking for sys/types.h... yes
    checking for sys/stat.h... yes
    checking for stdlib.h... yes
    checking for string.h... yes
    checking for memory.h... yes
    checking for strings.h... yes
    checking for inttypes.h... yes
    checking for stdint.h... yes
    checking for unistd.h... yes
    checking dlfcn.h usability... yes
    checking dlfcn.h presence... yes
    checking for dlfcn.h... yes
    checking the maximum length of command line arguments... 1572864
    checking command to parse /usr/bin/nm -B output from cc object... ok
    checking for objdir... .libs
    checking for ar... ar
    checking for ranlib... ranlib
    checking for strip... strip
    checking if cc supports -fno-rtti -fno-exceptions... no
    checking for cc option to produce PIC... -fPIC
    checking if cc PIC flag -fPIC works... yes
    checking if cc static flag -static works... yes
    checking if cc supports -c -o file.o... yes
    checking whether the cc linker (/usr/bin/ld -m elf_x86_64) supports shared libraries... yes
    checking whether -lc should be explicitly linked in... no
    checking dynamic linker characteristics... GNU/Linux ld.so
    checking how to hardcode library paths into programs... immediate
    checking whether stripping libraries is possible... yes
    checking if libtool supports shared libraries... yes
    checking whether to build shared libraries... yes
    checking whether to build static libraries... no
    
    creating libtool
    appending configuration tag "CXX" to libtool
    configure: creating ./config.status
    config.status: creating config.h
    
    root@evangelion [/home/cpeasyapache/src/php-5.3.10/ext/mcrypt]# make
    Code:
    /bin/sh /home/cpeasyapache/src/php-5.3.10/ext/mcrypt/libtool --mode=link cc -DPHP_ATOM_INC -I/home/cpeasyapache/src/php-5.3.10/ext/mcrypt/include -I/home/cpeasyapache/src/php-5.3.10/ext/mcrypt/main -I/home/cpeasyapache/src/php-5.3.10/ext/mcrypt -I/usr/local/include/php -I/usr/local/include/php/main -I/usr/local/include/php/TSRM -I/usr/local/include/php/Zend -I/usr/local/include/php/ext -I/usr/local/include/php/ext/date/lib -I/usr/local/include  -DHAVE_CONFIG_H  -g -O2   -o mcrypt.la -export-dynamic -avoid-version -prefer-pic -module -rpath /home/cpeasyapache/src/php-5.3.10/ext/mcrypt/modules  mcrypt.lo mcrypt_filter.lo -Wl,-rpath,/usr/local/lib -L/usr/local/lib -lmcrypt -lltdl
    cc -shared  .libs/mcrypt.o .libs/mcrypt_filter.o  -Wl,--rpath -Wl,/usr/local/lib -Wl,--rpath -Wl,/usr/local/lib -L/usr/local/lib /usr/local/lib/libmcrypt.so -lltdl  -Wl,-rpath -Wl,/usr/local/lib -Wl,-soname -Wl,mcrypt.so -o .libs/mcrypt.so
    creating mcrypt.la
    (cd .libs && rm -f mcrypt.la && ln -s ../mcrypt.la mcrypt.la)
    /bin/sh /home/cpeasyapache/src/php-5.3.10/ext/mcrypt/libtool --mode=install cp ./mcrypt.la /home/cpeasyapache/src/php-5.3.10/ext/mcrypt/modules
    cp ./.libs/mcrypt.so /home/cpeasyapache/src/php-5.3.10/ext/mcrypt/modules/mcrypt.so
    cp ./.libs/mcrypt.lai /home/cpeasyapache/src/php-5.3.10/ext/mcrypt/modules/mcrypt.la
    PATH="$PATH:/sbin" ldconfig -n /home/cpeasyapache/src/php-5.3.10/ext/mcrypt/modules
    ----------------------------------------------------------------------
    Libraries have been installed in:
       /home/cpeasyapache/src/php-5.3.10/ext/mcrypt/modules
    
    If you ever happen to want to link against installed libraries
    in a given directory, LIBDIR, you must either use libtool, and
    specify the full pathname of the library, or use the `-LLIBDIR'
    flag during linking and do at least one of the following:
       - add LIBDIR to the `LD_LIBRARY_PATH' environment variable
         during execution
       - add LIBDIR to the `LD_RUN_PATH' environment variable
         during linking
       - use the `-Wl,--rpath -Wl,LIBDIR' linker flag
       - have your system administrator add LIBDIR to `/etc/ld.so.conf'
    
    See any operating system documentation about shared libraries for
    more information, such as the ld(1) and ld.so(8) manual pages.
    ----------------------------------------------------------------------
    
    Build complete.
    Don't forget to run 'make test'.
    
    root@evangelion [/home/cpeasyapache/src/php-5.3.10/ext/mcrypt]# make test
    Code:
    Build complete.
    Don't forget to run 'make test'.
    
    
    Warning: PHP Startup: Invalid library (maybe not a PHP library) 'mcrypt.so' in Unknown on line 0
    
    Warning: PHP Startup: Invalid library (maybe not a PHP library) 'mcrypt.so' in Unknown on line 0
    
    =====================================================================
    PHP         : /usr/local/bin/php
    PHP_SAPI    : cli
    PHP_VERSION : 5.3.10
    ZEND_VERSION: 2.3.0
    PHP_OS      : Linux - Linux evangelion.*****.it 2.6.32-231.21.1.lve0.9.18.1.x86_64 #1 SMP Thu Jan 5 06:59:41 EST 2012 x86_64
    INI actual  : /home/cpeasyapache/src/php-5.3.10/ext/mcrypt/tmp-php.ini
    More .INIs  :
    CWD         : /home/cpeasyapache/src/php-5.3.10/ext/mcrypt
    Extra dirs  :
    VALGRIND    : Not used
    =====================================================================
    TIME START 2012-03-18 03:11:19
    =====================================================================
    FAIL Test for blowfish compatibility [tests/blowfish.phpt]
    FAIL Bug #35496 (Crash in mcrypt_generic()/mdecrypt_generic() without proper init). [tests/bug35496.phpt]
    FAIL Bug #37595 (mcrypt_generic calculates data length in wrong way) [tests/bug37595.phpt]
    FAIL Bug #41252 (Calling mcrypt_generic without first calling mcrypt_generic_init crashes) [tests/bug41252.phpt]
    FAIL Bug #43143 (Warning about empty IV with MCRYPT_MODE_ECB) [tests/bug43143.phpt]
    FAIL Bug #46010 (warnings incorrectly generated for iv in ecb mode) [tests/bug46010.phpt]
    FAIL Bug #49738 (calling mcrypt after mcrypt_generic_deinit crashes) [tests/bug49738.phpt]
    FAIL mcrypt_create_iv https://bugs.php.net/bug.php?id=55169 [tests/bug55169.phpt]
    FAIL Bug #8040 (MCRYPT_MODE_* do not seem to exist) [tests/bug8040.phpt]
    FAIL mcrypt_cbc [tests/mcrypt_cbc.phpt]
    FAIL Test mcrypt_cbc() function : basic functionality [tests/mcrypt_cbc_3des_decrypt.phpt]
    FAIL Test mcrypt_cbc() function : basic functionality [tests/mcrypt_cbc_3des_encrypt.phpt]
    FAIL Test mcrypt_cbc() function : error conditions [tests/mcrypt_cbc_error.phpt]
    FAIL Test mcrypt_cbc() function : usage variation [tests/mcrypt_cbc_variation1.phpt]
    FAIL Test mcrypt_cbc() function : usage variation [tests/mcrypt_cbc_variation2.phpt]
    FAIL Test mcrypt_cbc() function : usage variation [tests/mcrypt_cbc_variation3.phpt]
    FAIL Test mcrypt_cbc() function : usage variation [tests/mcrypt_cbc_variation4.phpt]
    FAIL Test mcrypt_cbc() function : usage variation [tests/mcrypt_cbc_variation5.phpt]
    FAIL mcrypt_cbf [tests/mcrypt_cbf.phpt]
    FAIL mcrypt_create_iv [tests/mcrypt_create_iv.phpt]
    FAIL mcrypt_decrypt [tests/mcrypt_decrypt.phpt]
    FAIL Test mcrypt_decrypt() function : basic functionality [tests/mcrypt_decrypt_3des_cbc.phpt]
    FAIL Test mcrypt_decrypt() function : basic functionality [tests/mcrypt_decrypt_3des_ecb.phpt]
    FAIL Test mcrypt_decrypt() function : error conditions [tests/mcrypt_decrypt_error.phpt]
    FAIL Test mcrypt_decrypt() function : usage variation [tests/mcrypt_decrypt_variation1.phpt]
    FAIL Test mcrypt_decrypt() function : usage variation [tests/mcrypt_decrypt_variation2.phpt]
    FAIL Test mcrypt_decrypt() function : usage variation [tests/mcrypt_decrypt_variation3.phpt]
    FAIL Test mcrypt_decrypt() function : usage variation [tests/mcrypt_decrypt_variation4.phpt]
    FAIL Test mcrypt_decrypt() function : usage variation [tests/mcrypt_decrypt_variation5.phpt]
    FAIL mcrypt_ecb [tests/mcrypt_ecb.phpt]
    FAIL Test mcrypt_cbc() function : basic functionality [tests/mcrypt_ecb_3des_decrypt.phpt]
    FAIL Test mcrypt_ecb() function : basic functionality [tests/mcrypt_ecb_3des_encrypt.phpt]
    FAIL Test mcrypt_ecb() function : error conditions [tests/mcrypt_ecb_error.phpt]
    FAIL Test mcrypt_ecb() function : usage variation [tests/mcrypt_ecb_variation1.phpt]
    FAIL Test mcrypt_ecb() function : usage variation [tests/mcrypt_ecb_variation2.phpt]
    FAIL Test mcrypt_ecb() function : usage variation [tests/mcrypt_ecb_variation3.phpt]
    FAIL Test mcrypt_ecb() function : usage variation [tests/mcrypt_ecb_variation4.phpt]
    FAIL Test mcrypt_ecb() function : usage variation [tests/mcrypt_ecb_variation5.phpt]
    FAIL mcrypt_enc_get_algorithms_name [tests/mcrypt_enc_get_algorithms_name.phpt]
    FAIL mcrypt_enc_get_block_size [tests/mcrypt_enc_get_block_size.phpt]
    FAIL mcrypt_enc_get_iv_size [tests/mcrypt_enc_get_iv_size.phpt]
    FAIL mcrypt_enc_get_key_size [tests/mcrypt_enc_get_key_size.phpt]
    FAIL mcrypt_enc_get_modes_name [tests/mcrypt_enc_get_mode_name.phpt]
    FAIL mcrypt_enc_get_supported_key_sizes [tests/mcrypt_enc_get_supported_key_sizes.phpt]
    FAIL mcrypt_enc_is_block_algorithm [tests/mcrypt_enc_is_block_algorithm.phpt]
    FAIL mcrypt_enc_is_block_algorithm_mode [tests/mcrypt_enc_is_block_algorithm_mode.phpt]
    FAIL mcrypt_enc_is_block_mode [tests/mcrypt_enc_is_block_mode.phpt]
    FAIL mcrypt_enc_self_test [tests/mcrypt_enc_self_test.phpt]
    FAIL Test mcrypt_encrypt() function : TripleDES functionality [tests/mcrypt_encrypt_3des_cbc.phpt]
    FAIL Test mcrypt_encrypt() function : TripleDES functionality [tests/mcrypt_encrypt_3des_ecb.phpt]
    FAIL Test mcrypt_encrypt() function : error conditions [tests/mcrypt_encrypt_error.phpt]
    FAIL Test mcrypt_encrypt() function : usage variation - different types for cipher [tests/mcrypt_encrypt_variation1.phpt]
    FAIL Test mcrypt_encrypt() function : usage variation [tests/mcrypt_encrypt_variation2.phpt]
    FAIL Test mcrypt_encrypt() function : usage variation [tests/mcrypt_encrypt_variation3.phpt]
    FAIL Test mcrypt_encrypt() function : usage variation [tests/mcrypt_encrypt_variation4.phpt]
    FAIL Test mcrypt_encrypt() function : usage variation [tests/mcrypt_encrypt_variation5.phpt]
    FAIL mcrypt filters [tests/mcrypt_filters.phpt]
    FAIL mcrypt_get_block_size [tests/mcrypt_get_block_size.phpt]
    FAIL mcrypt_get_cipher_name [tests/mcrypt_get_cipher_name.phpt]
    FAIL mcrypt_enc_get_iv_size [tests/mcrypt_get_iv_size.phpt]
    FAIL mcrypt_get_key_size [tests/mcrypt_get_key_size.phpt]
    FAIL mcrypt_list_algorithms [tests/mcrypt_list_algorithms.phpt]
    FAIL mcrypt_list_modes [tests/mcrypt_list_modes.phpt]
    FAIL mcrypt_module_get_algo_block_size [tests/mcrypt_module_get_algo_block_size.phpt]
    FAIL mcrypt_module_get_algo_key_size [tests/mcrypt_module_get_algo_key_size.phpt]
    FAIL mcrypt_module_get_supported_key_sizes [tests/mcrypt_module_get_supported_key_sizes.phpt]
    FAIL mcrypt_module_is_block_algorithm [tests/mcrypt_module_is_block_algorithm.phpt]
    FAIL mcrypt_module_is_block_algorithm_mode [tests/mcrypt_module_is_block_algorithm_mode.phpt]
    FAIL mcrypt_module_is_block_mode [tests/mcrypt_module_is_block_mode.phpt]
    FAIL mcrypt_module_open [tests/mcrypt_module_open.phpt]
    FAIL mcrypt_module_self_test [tests/mcrypt_module_self_test.phpt]
    FAIL mcrypt_ofb [tests/mcrypt_ofb.phpt]
    FAIL Test mcrypt_encrypt() function : TripleDES functionality [tests/mcrypt_rijndael128_128BitKey.phpt]
    FAIL Test mcrypt_encrypt() function : TripleDES functionality [tests/mcrypt_rijndael128_256BitKey.phpt]
    =====================================================================
    TIME END 2012-03-18 03:11:21
    
    =====================================================================
    TEST RESULT SUMMARY
    ---------------------------------------------------------------------
    Exts skipped    :    0
    Exts tested     :   38
    ---------------------------------------------------------------------
    
    Number of tests :   74                74
    Tests skipped   :    0 (  0.0%) --------
    Tests warned    :    0 (  0.0%) (  0.0%)
    Tests failed    :   74 (100.0%) (100.0%)
    Expected fail   :    0 (  0.0%) (  0.0%)
    Tests passed    :    0 (  0.0%) (  0.0%)
    ---------------------------------------------------------------------
    Time taken      :    2 seconds
    =====================================================================
    
    =====================================================================
    FAILED TEST SUMMARY
    ---------------------------------------------------------------------
    Test for blowfish compatibility [tests/blowfish.phpt]
    Bug #35496 (Crash in mcrypt_generic()/mdecrypt_generic() without proper init). [tests/bug35496.phpt]
    Bug #37595 (mcrypt_generic calculates data length in wrong way) [tests/bug37595.phpt]
    Bug #41252 (Calling mcrypt_generic without first calling mcrypt_generic_init crashes) [tests/bug41252.phpt]
    Bug #43143 (Warning about empty IV with MCRYPT_MODE_ECB) [tests/bug43143.phpt]
    Bug #46010 (warnings incorrectly generated for iv in ecb mode) [tests/bug46010.phpt]
    Bug #49738 (calling mcrypt after mcrypt_generic_deinit crashes) [tests/bug49738.phpt]
    mcrypt_create_iv https://bugs.php.net/bug.php?id=55169 [tests/bug55169.phpt]
    Bug #8040 (MCRYPT_MODE_* do not seem to exist) [tests/bug8040.phpt]
    mcrypt_cbc [tests/mcrypt_cbc.phpt]
    Test mcrypt_cbc() function : basic functionality [tests/mcrypt_cbc_3des_decrypt.phpt]
    Test mcrypt_cbc() function : basic functionality [tests/mcrypt_cbc_3des_encrypt.phpt]
    Test mcrypt_cbc() function : error conditions [tests/mcrypt_cbc_error.phpt]
    Test mcrypt_cbc() function : usage variation [tests/mcrypt_cbc_variation1.phpt]
    Test mcrypt_cbc() function : usage variation [tests/mcrypt_cbc_variation2.phpt]
    Test mcrypt_cbc() function : usage variation [tests/mcrypt_cbc_variation3.phpt]
    Test mcrypt_cbc() function : usage variation [tests/mcrypt_cbc_variation4.phpt]
    Test mcrypt_cbc() function : usage variation [tests/mcrypt_cbc_variation5.phpt]
    mcrypt_cbf [tests/mcrypt_cbf.phpt]
    mcrypt_create_iv [tests/mcrypt_create_iv.phpt]
    mcrypt_decrypt [tests/mcrypt_decrypt.phpt]
    Test mcrypt_decrypt() function : basic functionality [tests/mcrypt_decrypt_3des_cbc.phpt]
    Test mcrypt_decrypt() function : basic functionality [tests/mcrypt_decrypt_3des_ecb.phpt]
    Test mcrypt_decrypt() function : error conditions [tests/mcrypt_decrypt_error.phpt]
    Test mcrypt_decrypt() function : usage variation [tests/mcrypt_decrypt_variation1.phpt]
    Test mcrypt_decrypt() function : usage variation [tests/mcrypt_decrypt_variation2.phpt]
    Test mcrypt_decrypt() function : usage variation [tests/mcrypt_decrypt_variation3.phpt]
    Test mcrypt_decrypt() function : usage variation [tests/mcrypt_decrypt_variation4.phpt]
    Test mcrypt_decrypt() function : usage variation [tests/mcrypt_decrypt_variation5.phpt]
    mcrypt_ecb [tests/mcrypt_ecb.phpt]
    Test mcrypt_cbc() function : basic functionality [tests/mcrypt_ecb_3des_decrypt.phpt]
    Test mcrypt_ecb() function : basic functionality [tests/mcrypt_ecb_3des_encrypt.phpt]
    Test mcrypt_ecb() function : error conditions [tests/mcrypt_ecb_error.phpt]
    Test mcrypt_ecb() function : usage variation [tests/mcrypt_ecb_variation1.phpt]
    Test mcrypt_ecb() function : usage variation [tests/mcrypt_ecb_variation2.phpt]
    Test mcrypt_ecb() function : usage variation [tests/mcrypt_ecb_variation3.phpt]
    Test mcrypt_ecb() function : usage variation [tests/mcrypt_ecb_variation4.phpt]
    Test mcrypt_ecb() function : usage variation [tests/mcrypt_ecb_variation5.phpt]
    mcrypt_enc_get_algorithms_name [tests/mcrypt_enc_get_algorithms_name.phpt]
    mcrypt_enc_get_block_size [tests/mcrypt_enc_get_block_size.phpt]
    mcrypt_enc_get_iv_size [tests/mcrypt_enc_get_iv_size.phpt]
    mcrypt_enc_get_key_size [tests/mcrypt_enc_get_key_size.phpt]
    mcrypt_enc_get_modes_name [tests/mcrypt_enc_get_mode_name.phpt]
    mcrypt_enc_get_supported_key_sizes [tests/mcrypt_enc_get_supported_key_sizes.phpt]
    mcrypt_enc_is_block_algorithm [tests/mcrypt_enc_is_block_algorithm.phpt]
    mcrypt_enc_is_block_algorithm_mode [tests/mcrypt_enc_is_block_algorithm_mode.phpt]
    mcrypt_enc_is_block_mode [tests/mcrypt_enc_is_block_mode.phpt]
    mcrypt_enc_self_test [tests/mcrypt_enc_self_test.phpt]
    Test mcrypt_encrypt() function : TripleDES functionality [tests/mcrypt_encrypt_3des_cbc.phpt]
    Test mcrypt_encrypt() function : TripleDES functionality [tests/mcrypt_encrypt_3des_ecb.phpt]
    Test mcrypt_encrypt() function : error conditions [tests/mcrypt_encrypt_error.phpt]
    Test mcrypt_encrypt() function : usage variation - different types for cipher [tests/mcrypt_encrypt_variation1.phpt]
    Test mcrypt_encrypt() function : usage variation [tests/mcrypt_encrypt_variation2.phpt]
    Test mcrypt_encrypt() function : usage variation [tests/mcrypt_encrypt_variation3.phpt]
    Test mcrypt_encrypt() function : usage variation [tests/mcrypt_encrypt_variation4.phpt]
    Test mcrypt_encrypt() function : usage variation [tests/mcrypt_encrypt_variation5.phpt]
    mcrypt filters [tests/mcrypt_filters.phpt]
    mcrypt_get_block_size [tests/mcrypt_get_block_size.phpt]
    mcrypt_get_cipher_name [tests/mcrypt_get_cipher_name.phpt]
    mcrypt_enc_get_iv_size [tests/mcrypt_get_iv_size.phpt]
    mcrypt_get_key_size [tests/mcrypt_get_key_size.phpt]
    mcrypt_list_algorithms [tests/mcrypt_list_algorithms.phpt]
    mcrypt_list_modes [tests/mcrypt_list_modes.phpt]
    mcrypt_module_get_algo_block_size [tests/mcrypt_module_get_algo_block_size.phpt]
    mcrypt_module_get_algo_key_size [tests/mcrypt_module_get_algo_key_size.phpt]
    mcrypt_module_get_supported_key_sizes [tests/mcrypt_module_get_supported_key_sizes.phpt]
    mcrypt_module_is_block_algorithm [tests/mcrypt_module_is_block_algorithm.phpt]
    mcrypt_module_is_block_algorithm_mode [tests/mcrypt_module_is_block_algorithm_mode.phpt]
    mcrypt_module_is_block_mode [tests/mcrypt_module_is_block_mode.phpt]
    mcrypt_module_open [tests/mcrypt_module_open.phpt]
    mcrypt_module_self_test [tests/mcrypt_module_self_test.phpt]
    mcrypt_ofb [tests/mcrypt_ofb.phpt]
    Test mcrypt_encrypt() function : TripleDES functionality [tests/mcrypt_rijndael128_128BitKey.phpt]
    Test mcrypt_encrypt() function : TripleDES functionality [tests/mcrypt_rijndael128_256BitKey.phpt]
    =====================================================================
    
    You may have found a problem in PHP.
    This report can be automatically sent to the PHP QA team at
    http://qa.php.net/reports and http://news.php.net/php.qa.reports
    This gives us a better understanding of PHP's behavior.
    If you don't want to send the report immediately you can choose
    option "s" to save it.  You can then email it to qa-reports@lists.php.net later.
    Do you want to send this report now? [Yns]: n
    
    how can I fix this?

    best regards
    Andrea Guglielmo
     
  2. cPanelTristan

    cPanelTristan Quality Assurance Analyst
    Staff Member

    Joined:
    Oct 2, 2010
    Messages:
    7,623
    Likes Received:
    21
    Trophy Points:
    38
    Location:
    somewhere over the rainbow
    cPanel Access Level:
    Root Administrator
    Hello Andrea,

    mcrypt is listed in EasyApache's PHP Modules list for the Exhaustive Options List. Is there a reason it is being manually installed rather than using WHM > EasyApache (Apache Update) or /scripts/easyapache in command line to add it?

    Thanks!
     
  3. luigidelgado

    luigidelgado Well-Known Member

    Joined:
    Nov 6, 2010
    Messages:
    109
    Likes Received:
    2
    Trophy Points:
    16
    Location:
    Mexico
    cPanel Access Level:
    Root Administrator
    Twitter:
    I have the same problem, I have installed mcrypt using easyapache but having the same warnings also for GD.so

    strange...
    Right now I am recompiling with 5.13 version.

    Edit:
    Question does mcrypt need to be loaded in PHP.ini as an extension??
    extension = "mcrypt.so"
     
    #3 luigidelgado, May 25, 2012
    Last edited: May 25, 2012
  4. cPanelTristan

    cPanelTristan Quality Assurance Analyst
    Staff Member

    Joined:
    Oct 2, 2010
    Messages:
    7,623
    Likes Received:
    21
    Trophy Points:
    38
    Location:
    somewhere over the rainbow
    cPanel Access Level:
    Root Administrator
    No, it would not need to be loaded as an extension. Does it appear in "php -m | grep -i mcrypt" as loading?
     
Loading...

Share This Page