The Community Forums

Interact with an entire community of cPanel & WHM users!
  1. This site uses cookies. By continuing to use this site, you are agreeing to our use of cookies. Learn More.

Stats not being processed

Discussion in 'General Discussion' started by adad, Nov 22, 2005.

  1. adad

    adad Member

    Joined:
    Feb 10, 2004
    Messages:
    18
    Likes Received:
    0
    Trophy Points:
    1
    My server is not processing stats: neither webalizer, awstats nor analog are updated, although I can manually update awstats from within cPanel.

    I don't see any entries in cron.daily that would run such weblogs update on a daily basis.

    What entries should there be in cron.daily directory for it to run properly?

    Thank you for your help.
     
  2. bijo

    bijo Well-Known Member

    Joined:
    Aug 21, 2004
    Messages:
    475
    Likes Received:
    0
    Trophy Points:
    16
    Location:
    India
  3. adad

    adad Member

    Joined:
    Feb 10, 2004
    Messages:
    18
    Likes Received:
    0
    Trophy Points:
    1
    Quite useful.
    I don't have such an entry in WHM.

    Besides, manually running /usr/local/cpanel/cpanellogd OR /scripts/runstatsonce OR /scripts/runweblogs <username> all abort with this error:

    make[2]: Entering directory `/usr/local/cpanel/src/3rdparty/gpl/rrdtool-1.0.48/perl-shared'
    cc -c -I.. -I../src -I../gd1.3 -DHAVE_CONFIG_H -O2 -DVERSION="1.000481" -DXS_VERSION="1.000481" -fpic "-I/usr/lib/perl5/5.8.7/i686-linux/CORE" -DPERLPATCHLEVEL=8 RRDs.c
    In file included from ../src/rrd_tool.h:25,
    from RRDs.xs:13:
    ../src/config_aux.h:8:1: warning: "strchr" redefined
    In file included from /usr/include/string.h:417,
    from /usr/lib/perl5/5.8.7/i686-linux/CORE/perl.h:731,
    from RRDs.xs:6:
    /usr/include/bits/string2.h:396:1: warning: this is the location of the previous definition
    In file included from ../src/rrd_tool.h:25,
    from RRDs.xs:13:
    ../src/config_aux.h:80:2: error: #error "Can't compile without finite function"
    ../src/config_aux.h:84:2: error: #error "Can't compile without isinf function"
    make[2]: *** [RRDs.o] Error 1
    make[2]: Leaving directory `/usr/local/cpanel/src/3rdparty/gpl/rrdtool-1.0.48/perl-shared'
    make[1]: *** [perl_shared] Error 2
    make[1]: Leaving directory `/usr/local/cpanel/src/3rdparty/gpl/rrdtool-1.0.48'
    make: *** [install-recursive] Error 1
    /usr/bin/perl: symbol lookup error: /usr/local/cpanel/3rdparty/lib/perl/auto/RRDs/RRDs.so: undefined symbol: Perl_Gthr_key_ptr

    Any ideas?
     
  4. aby

    aby Well-Known Member

    Joined:
    May 31, 2005
    Messages:
    638
    Likes Received:
    0
    Trophy Points:
    16
    Location:
    India

    I doubt an issue with the rrdtool

    Can you try

    /scripts/rrdtoolinstall

    and see if that helps
     
Loading...

Share This Page